"Langue","ID","Page trouvée","Pseudo","Anciens pseudos","Genre","Âge","Ville","Pays","Likes profil","Nombre amis","Nombre ajouté par","Liste amis","Liste groupes","Score Mush","5ème Colonne","Aliments Congelés avalés","Altruiste","Annonce Générale","Apprentissage Achevé","Apprentrons","Approvisionneur","Artefacts collectés","Aventurier de l'espace","Aventurier légendaire","Bailloné","Balayages Complets","Boucher","Bouclier Plasma","Bourreau Des Mush","Champignon acidulé","Champignon caché","Champignon mûre","Champignon précoce","Chats câlinés","Chercheur","Chirurgien","Concepteur","Cristallites aigus","Décrypteur de l'Enigme","Dernier Commandant","Dernier survivant","Eden, terre contaminée","Eden, terre promise","Embarquement sur le Daedalus","Equipe De Chercheurs","Equipe Technique","Explorateur","Extinction d'Incendies","Grenadier","Grippe de NERON","Héros de l'espace","Héros légendaire","Homme Politique","Hunters Abattus","Infecté","Infecteur","Initié","Inspections Réussies","Jour 10 Atteint","Jour 15 Atteint","Jour 20 Atteint","Jour 30 Atteint","Jour 5 Atteint","Jours sans s'endormir","Jugement","Kivanç Terzi contacté","Laissez manger les petits cachets !","Maladies contractées","Maladies vénériennes contractées","Missions","Natamiste","Nils contacté","Nombre de cycles à contempler son oeuvre","Nombre de cycles à tourner en rond","Nombre de cycles passés à allu...écouter les autres","Nombre de cycles passés à bouder dans son coin.","Nombre de cycles passés à coiffer sa touffe.","Nombre de cycles passés à compter ses billets","Nombre de cycles passés à cuisiner des plats suspects","Nombre de cycles passés à cultiver des plantes hallucinogènes","Nombre de cycles passés à dégommer des trucs","Nombre de cycles passés à draguer à tout va.","Nombre de cycles passés à fréquenter des 3èmes types","Nombre de cycles passés à jouer au chef","Nombre de cycles passés à lire des cartes","Nombre de cycles passés à passer son temps à caresser son chat","Nombre de cycles passés à phongiférer dans son coin","Nombre de cycles passés à scruter l'infiniment petit","Nombre de cycles passés à se faire préléver des échantillons sanguins","Nombre de cycles passés à surfer sur les basses fréquences","Nombre de cycles passés à vénérer la fédération.","Nouvelles générations","Personnel Soignant","Peti champi deviendra grand","Petit joueur","PILGRED EST DE RETOUR !","Pionnier de Xyloph","Planètes Détectées","Plantations","Plats cuisinés","Portes réparées","Psychanalyse Totale","Rations avalées","Rations cuisinées avalées","Rébellion !","Responsable Des Communications","Revolution !","Siestes","Signalement de pannes","Signalements d'Incendies","Sol","Soldat de l'Humanité","Sommeil fongique","Soutiens Psychologiques","Spécialiste en artefacts","Squatteur De Cafetière","Supporter","Sus aux parasites !","Télégénie","Triple Victoire","Un café pour la 16 !","Vieilles connaissances","Voyage Le Plus Long","Tout le monde vous aime !","Date"
"fr",9348174,"1","cassandre",,"Female","20","MEAUX","France","0","0","0",,,"22","0","0","0","0","1","0","0","0",0,0,"0","0","0","0","0","0","0","0","0","0","0","0","0",0,"1","0","0",0,"0",0,"1","4","0","0","0",0,"0",0,"0","0","0","0",0,"1","0","0","0","0","0","0",0,"0","0","2",0,"0","0","1","0","0","0","0","9","0","0","0","0","0","0","0","0","0","0","0","0","0","0",0,"0","0","0","0",0,"0","0","0","1","0","1","0","1","0","0",0,"0","0","0","1",0,"0","0","0","0",0,"0","0","0",0,"4","0",2021-11-11 10:48:34
"fr",9348175,"0",,,,,,,,,,,,,,,,,,,,,,,,,,,,,,,,,,,,,,,,,,,,,,,,,,,,,,,,,,,,,,,,,,,,,,,,,,,,,,,,,,,,,,,,,,,,,,,,,,,,,,,,,,,,,,,,,,,,,,,,,,,2021-11-11 10:48:37
"fr",9348178,"0",,,,,,,,,,,,,,,,,,,,,,,,,,,,,,,,,,,,,,,,,,,,,,,,,,,,,,,,,,,,,,,,,,,,,,,,,,,,,,,,,,,,,,,,,,,,,,,,,,,,,,,,,,,,,,,,,,,,,,,,,,,2021-11-11 10:48:41
"fr",9348184,"0",,,,,,,,,,,,,,,,,,,,,,,,,,,,,,,,,,,,,,,,,,,,,,,,,,,,,,,,,,,,,,,,,,,,,,,,,,,,,,,,,,,,,,,,,,,,,,,,,,,,,,,,,,,,,,,,,,,,,,,,,,,2021-11-11 10:48:44
"fr",9348226,"0",,,,,,,,,,,,,,,,,,,,,,,,,,,,,,,,,,,,,,,,,,,,,,,,,,,,,,,,,,,,,,,,,,,,,,,,,,,,,,,,,,,,,,,,,,,,,,,,,,,,,,,,,,,,,,,,,,,,,,,,,,,2021-11-11 10:48:47
"fr",9348448,"0",,,,,,,,,,,,,,,,,,,,,,,,,,,,,,,,,,,,,,,,,,,,,,,,,,,,,,,,,,,,,,,,,,,,,,,,,,,,,,,,,,,,,,,,,,,,,,,,,,,,,,,,,,,,,,,,,,,,,,,,,,,2021-11-11 10:48:50
"fr",9348467,"1","Bleizh",,"Unknown",,,,"0","1","1","2302966",,"6","0","0","0","0","1","0","0","0",0,0,"0","5","0","0","0","0","0","0","0","0","0","0","0",0,"1","0","0",0,"0",0,"1","3","0","0","0",0,"0",0,"0","0","0","0",0,"1","0","0","0","0","0","0",0,"1","0","0",0,"0","0","1","0","0","0","0","0","23","0","0","0","0","0","0","0","0","0","0","0","0","0",0,"0","0","0","0",0,"0","0","0","1","0","1","0","2","0","0",0,"0","0","0","2",0,"0","0","0","0",0,"0","0","0",0,"4","0",2021-11-11 10:48:53
"fr",9348484,"1","Roy",,"Unknown",,,,"0","0","0",,,"11","0","0","0","0","0","0","0","0",0,0,"0","1","0","0","0","0","0","0","0","0","0","0","0",0,"1","0","0",0,"0",0,"3","0","0","0","0",0,"0",0,"0","0","0","0",0,"0","0","0","0","0","0","0",0,"0","0","0",0,"0","0","0","0","0","0","19","0","0","0","0","0","0","0","0","0","0","0","0","0","0","0",0,"0","0","0","0",0,"0","0","0","1","0","1","0","0","0","0",0,"0","0","0","2",0,"0","0","0","0",0,"0","0","0",0,"4","0",2021-11-11 10:48:56
"fr",9348487,"1","Neren",,"Unknown",,,,"0","0","0",,,"15","0","0","0","0","0","0","0","0",0,0,"0","0","0","0","0","0","0","0","0","1","1","1","0",0,"1","0","0",0,"0",0,"3","3","0","0","0",0,"0",0,"0","0","0","0",0,"0","0","0","0","0","1","0",0,"0","1","1",0,"0","0","1","0","0","0","0","0","0","0","0","0","0","0","0","0","0","0","24","8","0","0",0,"0","0","0","0",0,"0","0","0","0","0","2","0","1","0","0",0,"0","0","0","0",0,"0","0","0","0",0,"0","0","0",0,"5","0",2021-11-11 10:49:00
"fr",9348528,"1","DoPanzer",,"Unknown",,,,"0","0","0",,,"0","0","0","0","0","0","0","0","0",0,0,"0","2","0","0","0","0","0","0","0","0","0","0","0",0,"1","0","0",0,"0",0,"2","0","0","0","0",0,"0",0,"0","0","0","0",0,"0","0","0","0","0","0","0",0,"1","0","0",0,"0","0","1","0","0","0","0","0","0","0","0","0","0","0","0","0","0","0","0","13","0","0",0,"0","0","0","0",0,"0","0","0","0","0","0","0","1","0","0",0,"0","0","0","0",0,"0","0","0","0",0,"0","0","0",0,"3","0",2021-11-11 10:49:03
"fr",9348561,"0",,,,,,,,,,,,,,,,,,,,,,,,,,,,,,,,,,,,,,,,,,,,,,,,,,,,,,,,,,,,,,,,,,,,,,,,,,,,,,,,,,,,,,,,,,,,,,,,,,,,,,,,,,,,,,,,,,,,,,,,,,,2021-11-11 10:49:09
"fr",9348564,"0",,,,,,,,,,,,,,,,,,,,,,,,,,,,,,,,,,,,,,,,,,,,,,,,,,,,,,,,,,,,,,,,,,,,,,,,,,,,,,,,,,,,,,,,,,,,,,,,,,,,,,,,,,,,,,,,,,,,,,,,,,,2021-11-11 10:49:12
"fr",9348566,"0",,,,,,,,,,,,,,,,,,,,,,,,,,,,,,,,,,,,,,,,,,,,,,,,,,,,,,,,,,,,,,,,,,,,,,,,,,,,,,,,,,,,,,,,,,,,,,,,,,,,,,,,,,,,,,,,,,,,,,,,,,,2021-11-11 10:49:15
"fr",9348568,"0",,,,,,,,,,,,,,,,,,,,,,,,,,,,,,,,,,,,,,,,,,,,,,,,,,,,,,,,,,,,,,,,,,,,,,,,,,,,,,,,,,,,,,,,,,,,,,,,,,,,,,,,,,,,,,,,,,,,,,,,,,,2021-11-11 10:49:18
"fr",9348569,"0",,,,,,,,,,,,,,,,,,,,,,,,,,,,,,,,,,,,,,,,,,,,,,,,,,,,,,,,,,,,,,,,,,,,,,,,,,,,,,,,,,,,,,,,,,,,,,,,,,,,,,,,,,,,,,,,,,,,,,,,,,,2021-11-11 10:49:21
"fr",9348646,"1","Royale-Menthol",,"Unknown",,,,"0","0","0",,,"0","0","0","0","0","0","0","0","0",0,0,"0","3","0","0","0","0","0","0","0","0","0","0","0",0,"0","0","0",0,"0",0,"4","1","0","0","0",0,"0",0,"0","0","0","0",0,"0","0","0","0","0","1","0",0,"0","0","1",0,"0","0","0","0","0","30","0","0","0","0","0","0","0","0","0","0","0","0","0","0","0","0",0,"0","0","0","0",0,"0","0","0","0","1","0","0","0","0","0",0,"0","0","0","2",0,"0","0","0","0",0,"0","0","0",0,"5","0",2021-11-11 10:49:25
"fr",9348650,"1","SekouBarry20",,"Unknown",,,,"0","0","0",,,"0","0","0","0","0","0","0","0","0",0,0,"0","2","0","0","0","0","0","0","0","0","0","0","0",0,"0","0","0",0,"0",0,"2","1","0","0","0",0,"0",0,"0","0","0","0",0,"0","0","0","0","0","0","0",0,"0","0","0",0,"0","0","0","0","0","0","14","0","0","0","0","0","0","0","0","0","0","0","0","0","0","0",0,"0","0","0","0",0,"0","0","0","0","0","0","0","0","0","0",0,"0","0","0","0",0,"0","0","0","0",0,"0","0","0",0,"3","0",2021-11-11 10:49:28
"fr",9348681,"0",,,,,,,,,,,,,,,,,,,,,,,,,,,,,,,,,,,,,,,,,,,,,,,,,,,,,,,,,,,,,,,,,,,,,,,,,,,,,,,,,,,,,,,,,,,,,,,,,,,,,,,,,,,,,,,,,,,,,,,,,,,2021-11-11 10:49:31
"fr",9348682,"0",,,,,,,,,,,,,,,,,,,,,,,,,,,,,,,,,,,,,,,,,,,,,,,,,,,,,,,,,,,,,,,,,,,,,,,,,,,,,,,,,,,,,,,,,,,,,,,,,,,,,,,,,,,,,,,,,,,,,,,,,,,2021-11-11 10:49:34
"fr",9348684,"0",,,,,,,,,,,,,,,,,,,,,,,,,,,,,,,,,,,,,,,,,,,,,,,,,,,,,,,,,,,,,,,,,,,,,,,,,,,,,,,,,,,,,,,,,,,,,,,,,,,,,,,,,,,,,,,,,,,,,,,,,,,2021-11-11 10:49:37
"fr",9348707,"1","lol40",,"Unknown",,,,"0","0","0",,,"84","1","0","0","0","1","0","0","0",0,0,"0","30","0","3","0","0","0","0","0","5","0","0","1",0,"6","0","0",0,"0",0,"13","10","0","0","0",0,"0",0,"0","1","0","0",0,"1","1","0","0","0","6","1",0,"5","4","5",0,"0","0","8","0","0","55","0","40","3","28","113","0","0","0","34","38","0","0","0","35","24","17",0,"0","0","0","1",0,"3","0","7","3","0","11","7","5","0","0",0,"1","0","2","13",0,"0","0","6","0",0,"3","0","4",0,"14","2",2021-11-11 10:49:40
"fr",9348770,"0",,,,,,,,,,,,,,,,,,,,,,,,,,,,,,,,,,,,,,,,,,,,,,,,,,,,,,,,,,,,,,,,,,,,,,,,,,,,,,,,,,,,,,,,,,,,,,,,,,,,,,,,,,,,,,,,,,,,,,,,,,,2021-11-11 10:49:43
"fr",9348771,"0",,,,,,,,,,,,,,,,,,,,,,,,,,,,,,,,,,,,,,,,,,,,,,,,,,,,,,,,,,,,,,,,,,,,,,,,,,,,,,,,,,,,,,,,,,,,,,,,,,,,,,,,,,,,,,,,,,,,,,,,,,,2021-11-11 10:49:47
"fr",9348772,"0",,,,,,,,,,,,,,,,,,,,,,,,,,,,,,,,,,,,,,,,,,,,,,,,,,,,,,,,,,,,,,,,,,,,,,,,,,,,,,,,,,,,,,,,,,,,,,,,,,,,,,,,,,,,,,,,,,,,,,,,,,,2021-11-11 10:49:50
"fr",9348773,"0",,,,,,,,,,,,,,,,,,,,,,,,,,,,,,,,,,,,,,,,,,,,,,,,,,,,,,,,,,,,,,,,,,,,,,,,,,,,,,,,,,,,,,,,,,,,,,,,,,,,,,,,,,,,,,,,,,,,,,,,,,,2021-11-11 10:49:53
"fr",9348776,"0",,,,,,,,,,,,,,,,,,,,,,,,,,,,,,,,,,,,,,,,,,,,,,,,,,,,,,,,,,,,,,,,,,,,,,,,,,,,,,,,,,,,,,,,,,,,,,,,,,,,,,,,,,,,,,,,,,,,,,,,,,,2021-11-11 10:49:56
"fr",9348780,"0",,,,,,,,,,,,,,,,,,,,,,,,,,,,,,,,,,,,,,,,,,,,,,,,,,,,,,,,,,,,,,,,,,,,,,,,,,,,,,,,,,,,,,,,,,,,,,,,,,,,,,,,,,,,,,,,,,,,,,,,,,,2021-11-11 10:49:59
"fr",9348781,"0",,,,,,,,,,,,,,,,,,,,,,,,,,,,,,,,,,,,,,,,,,,,,,,,,,,,,,,,,,,,,,,,,,,,,,,,,,,,,,,,,,,,,,,,,,,,,,,,,,,,,,,,,,,,,,,,,,,,,,,,,,,2021-11-11 10:50:04
"fr",9348782,"0",,,,,,,,,,,,,,,,,,,,,,,,,,,,,,,,,,,,,,,,,,,,,,,,,,,,,,,,,,,,,,,,,,,,,,,,,,,,,,,,,,,,,,,,,,,,,,,,,,,,,,,,,,,,,,,,,,,,,,,,,,,2021-11-11 10:50:07
"fr",9348783,"0",,,,,,,,,,,,,,,,,,,,,,,,,,,,,,,,,,,,,,,,,,,,,,,,,,,,,,,,,,,,,,,,,,,,,,,,,,,,,,,,,,,,,,,,,,,,,,,,,,,,,,,,,,,,,,,,,,,,,,,,,,,2021-11-11 10:50:10
"fr",9348784,"0",,,,,,,,,,,,,,,,,,,,,,,,,,,,,,,,,,,,,,,,,,,,,,,,,,,,,,,,,,,,,,,,,,,,,,,,,,,,,,,,,,,,,,,,,,,,,,,,,,,,,,,,,,,,,,,,,,,,,,,,,,,2021-11-11 10:50:13
"fr",9349050,"0",,,,,,,,,,,,,,,,,,,,,,,,,,,,,,,,,,,,,,,,,,,,,,,,,,,,,,,,,,,,,,,,,,,,,,,,,,,,,,,,,,,,,,,,,,,,,,,,,,,,,,,,,,,,,,,,,,,,,,,,,,,2021-11-11 10:50:16
"fr",9349088,"0",,,,,,,,,,,,,,,,,,,,,,,,,,,,,,,,,,,,,,,,,,,,,,,,,,,,,,,,,,,,,,,,,,,,,,,,,,,,,,,,,,,,,,,,,,,,,,,,,,,,,,,,,,,,,,,,,,,,,,,,,,,2021-11-11 10:50:20
"fr",9349091,"0",,,,,,,,,,,,,,,,,,,,,,,,,,,,,,,,,,,,,,,,,,,,,,,,,,,,,,,,,,,,,,,,,,,,,,,,,,,,,,,,,,,,,,,,,,,,,,,,,,,,,,,,,,,,,,,,,,,,,,,,,,,2021-11-11 10:50:23
"fr",9349099,"0",,,,,,,,,,,,,,,,,,,,,,,,,,,,,,,,,,,,,,,,,,,,,,,,,,,,,,,,,,,,,,,,,,,,,,,,,,,,,,,,,,,,,,,,,,,,,,,,,,,,,,,,,,,,,,,,,,,,,,,,,,,2021-11-11 10:50:26
"fr",9349100,"0",,,,,,,,,,,,,,,,,,,,,,,,,,,,,,,,,,,,,,,,,,,,,,,,,,,,,,,,,,,,,,,,,,,,,,,,,,,,,,,,,,,,,,,,,,,,,,,,,,,,,,,,,,,,,,,,,,,,,,,,,,,2021-11-11 10:50:29
"fr",9349161,"1","Incurflo","Florent01110,2020-04-18","Male","18","Le miroir","France","0","0","1",,,"98","0","0","0","0","0","1","16","2",0,0,"0","103","0","5","0","0","0","0","0","0","2","0","1",0,"12","0","0",0,"0",0,"19","15","3","14","0",0,"0",0,"0","23","5","0",0,"0","2","1","1","0","11","0",0,"10","2","10",0,"0","0","8","81","100","0","0","0","7","188","0","26","54","0","29","0","0","109","0","0","0","0",0,"0","0","0","2",0,"11","0","0","1","0","5","0","5","0","0",0,"24","0","1","15",0,"0","1","3","1",0,"2","0","2",0,"21","8",2021-11-11 10:50:33
"fr",9349199,"1","soso81",,"Unknown",,,,"0","0","0",,,"9","0","0","0","0","0","0","0","0",0,0,"0","2","0","0","0","0","0","0","0","0","0","0","0",0,"0","0","0",0,"0",0,"0","4","0","0","0",0,"0",0,"0","0","0","0",0,"0","0","0","0","0","0","0",0,"1","0","0",0,"0","0","1","0","0","0","0","0","0","0","0","11","0","0","0","0","0","0","0","0","0","0",0,"0","0","0","0",0,"0","0","0","0","0","0","0","1","0","0",0,"0","0","0","0",0,"0","0","0","0",0,"0","0","0",0,"3","0",2021-11-11 10:50:36
"fr",9349256,"0",,,,,,,,,,,,,,,,,,,,,,,,,,,,,,,,,,,,,,,,,,,,,,,,,,,,,,,,,,,,,,,,,,,,,,,,,,,,,,,,,,,,,,,,,,,,,,,,,,,,,,,,,,,,,,,,,,,,,,,,,,,2021-11-11 10:50:39
"fr",9349260,"0",,,,,,,,,,,,,,,,,,,,,,,,,,,,,,,,,,,,,,,,,,,,,,,,,,,,,,,,,,,,,,,,,,,,,,,,,,,,,,,,,,,,,,,,,,,,,,,,,,,,,,,,,,,,,,,,,,,,,,,,,,,2021-11-11 10:50:42
"fr",9349263,"0",,,,,,,,,,,,,,,,,,,,,,,,,,,,,,,,,,,,,,,,,,,,,,,,,,,,,,,,,,,,,,,,,,,,,,,,,,,,,,,,,,,,,,,,,,,,,,,,,,,,,,,,,,,,,,,,,,,,,,,,,,,2021-11-11 10:50:46
"fr",9349264,"0",,,,,,,,,,,,,,,,,,,,,,,,,,,,,,,,,,,,,,,,,,,,,,,,,,,,,,,,,,,,,,,,,,,,,,,,,,,,,,,,,,,,,,,,,,,,,,,,,,,,,,,,,,,,,,,,,,,,,,,,,,,2021-11-11 10:50:49
"fr",9349265,"0",,,,,,,,,,,,,,,,,,,,,,,,,,,,,,,,,,,,,,,,,,,,,,,,,,,,,,,,,,,,,,,,,,,,,,,,,,,,,,,,,,,,,,,,,,,,,,,,,,,,,,,,,,,,,,,,,,,,,,,,,,,2021-11-11 10:50:52
"fr",9349267,"0",,,,,,,,,,,,,,,,,,,,,,,,,,,,,,,,,,,,,,,,,,,,,,,,,,,,,,,,,,,,,,,,,,,,,,,,,,,,,,,,,,,,,,,,,,,,,,,,,,,,,,,,,,,,,,,,,,,,,,,,,,,2021-11-11 10:50:55
"fr",9349292,"1","dry12",,"Unknown",,,,"0","0","0",,,"89","0","0","0","0","0","1","15","4",0,0,"0","29","0","1","1","0","0","0","0","1","0","0","0",0,"2","0","0",0,"0",0,"10","11","4","4","0",0,"0",0,"0","0","0","0",0,"0","1","0","0","0","1","1",0,"0","0","3",0,"0","0","2","0","0","0","0","80","0","0","26","0","0","0","0","0","0","0","0","0","0","0",0,"0","0","0","1",0,"3","3","0","1","0","7","0","6","0","1",0,"0","0","0","4",0,"0","3","0","0",0,"2","0","1",0,"11","4",2021-11-11 10:50:58
"fr",9349309,"1","kyaz",,"Unknown",,,,"0","0","0",,,"1","0","0","0","0","0","0","0","0",0,0,"0","2","0","0","0","0","0","0","0","0","0","0","0",0,"1","0","0",0,"0",0,"3","3","0","0","0",0,"0",0,"0","0","0","0",0,"1","0","0","0","0","0","0",0,"1","0","0",0,"0","0","1","0","0","0","0","0","0","23","0","0","0","0","0","0","0","0","0","0","0","0",0,"0","0","0","0",0,"0","0","0","1","0","1","0","1","0","0",0,"0","0","0","0",0,"0","0","0","0",0,"0","0","0",0,"4","0",2021-11-11 10:51:01
"fr",9349333,"0",,,,,,,,,,,,,,,,,,,,,,,,,,,,,,,,,,,,,,,,,,,,,,,,,,,,,,,,,,,,,,,,,,,,,,,,,,,,,,,,,,,,,,,,,,,,,,,,,,,,,,,,,,,,,,,,,,,,,,,,,,,2021-11-11 10:51:05
"fr",9349335,"0",,,,,,,,,,,,,,,,,,,,,,,,,,,,,,,,,,,,,,,,,,,,,,,,,,,,,,,,,,,,,,,,,,,,,,,,,,,,,,,,,,,,,,,,,,,,,,,,,,,,,,,,,,,,,,,,,,,,,,,,,,,2021-11-11 10:51:08
"fr",9349338,"0",,,,,,,,,,,,,,,,,,,,,,,,,,,,,,,,,,,,,,,,,,,,,,,,,,,,,,,,,,,,,,,,,,,,,,,,,,,,,,,,,,,,,,,,,,,,,,,,,,,,,,,,,,,,,,,,,,,,,,,,,,,2021-11-11 10:51:11
"fr",9349339,"0",,,,,,,,,,,,,,,,,,,,,,,,,,,,,,,,,,,,,,,,,,,,,,,,,,,,,,,,,,,,,,,,,,,,,,,,,,,,,,,,,,,,,,,,,,,,,,,,,,,,,,,,,,,,,,,,,,,,,,,,,,,2021-11-11 10:51:14
"fr",9349340,"0",,,,,,,,,,,,,,,,,,,,,,,,,,,,,,,,,,,,,,,,,,,,,,,,,,,,,,,,,,,,,,,,,,,,,,,,,,,,,,,,,,,,,,,,,,,,,,,,,,,,,,,,,,,,,,,,,,,,,,,,,,,2021-11-11 10:51:17
"fr",9349409,"1","Bitchbetterhave",,"Unknown",,,,"0","0","0",,,"7","0","0","0","0","1","0","0","0",0,0,"0","1","0","1","0","0","0","0","0","0","0","0","0",0,"1","0","0",0,"0",0,"3","2","0","0","0",0,"0",0,"0","0","0","0",0,"1","0","0","0","0","0","0",0,"0","0","1",0,"0","0","1","0","0","0","0","19","0","0","0","0","0","0","0","0","0","0","0","0","0","0",0,"0","0","0","0",0,"1","0","0","1","0","1","0","0","0","0",0,"0","0","0","1",0,"0","0","0","0",0,"0","0","0",0,"3","0",2021-11-11 10:51:20
"fr",9349437,"1","vlekev",,"Male",,,,"0","0","0",,,"42","0","0","0","0","1","0","0","0",0,0,"0","4","0","1","0","0","0","0","0","0","0","1","0",0,"2","0","0",0,"0",0,"3","6","0","1","0",0,"0",0,"0","5","0","0",0,"1","0","0","0","0","2","0",0,"1","0","1",0,"0","0","1","0","28","0","0","0","0","0","0","0","0","0","0","0","0","0","0","61","0","0",0,"0","0","0","0",0,"0","0","1","2","0","1","1","3","0","0",0,"0","1","1","5",0,"0","0","0","0",0,"0","0","0",0,"9","0",2021-11-11 10:51:24
"fr",9349452,"0",,,,,,,,,,,,,,,,,,,,,,,,,,,,,,,,,,,,,,,,,,,,,,,,,,,,,,,,,,,,,,,,,,,,,,,,,,,,,,,,,,,,,,,,,,,,,,,,,,,,,,,,,,,,,,,,,,,,,,,,,,,2021-11-11 10:51:28
"fr",9349460,"0",,,,,,,,,,,,,,,,,,,,,,,,,,,,,,,,,,,,,,,,,,,,,,,,,,,,,,,,,,,,,,,,,,,,,,,,,,,,,,,,,,,,,,,,,,,,,,,,,,,,,,,,,,,,,,,,,,,,,,,,,,,2021-11-11 10:51:31
"fr",9349483,"1","Cicix",,"Unknown",,,,"0","0","0",,,"8","0","0","0","0","1","0","0","0",0,0,"0","4","0","0","0","0","0","0","0","0","0","0","0",0,"0","0","0",0,"0",0,"1","2","0","0","0",0,"0",0,"0","0","0","0",0,"1","0","0","0","0","0","0",0,"0","0","0",0,"0","0","0","0","0","0","0","0","0","0","0","0","0","0","0","0","9","0","20","0","0","0",0,"0","0","0","0",0,"0","0","0","1","0","1","0","0","0","0",0,"0","0","0","1",0,"0","0","0","0",0,"0","0","0",0,"3","0",2021-11-11 10:51:35
"fr",9349493,"0",,,,,,,,,,,,,,,,,,,,,,,,,,,,,,,,,,,,,,,,,,,,,,,,,,,,,,,,,,,,,,,,,,,,,,,,,,,,,,,,,,,,,,,,,,,,,,,,,,,,,,,,,,,,,,,,,,,,,,,,,,,2021-11-11 10:51:38
"fr",9349501,"0",,,,,,,,,,,,,,,,,,,,,,,,,,,,,,,,,,,,,,,,,,,,,,,,,,,,,,,,,,,,,,,,,,,,,,,,,,,,,,,,,,,,,,,,,,,,,,,,,,,,,,,,,,,,,,,,,,,,,,,,,,,2021-11-11 10:51:41
"fr",9349503,"0",,,,,,,,,,,,,,,,,,,,,,,,,,,,,,,,,,,,,,,,,,,,,,,,,,,,,,,,,,,,,,,,,,,,,,,,,,,,,,,,,,,,,,,,,,,,,,,,,,,,,,,,,,,,,,,,,,,,,,,,,,,2021-11-11 10:51:44
"fr",9349510,"1","abdelk",,"Unknown",,,,"0","1","3","8810761",,"19","0","0","0","0","1","0","0","0",0,0,"0","0","0","0","0","0","0","0","0","0","0","0","0",0,"0","0","0",0,"0",0,"2","2","0","0","0",0,"0",0,"0","0","0","0",0,"1","0","0","0","0","0","0",0,"0","0","1",0,"0","0","0","0","0","0","0","0","0","0","0","21","0","0","0","0","0","0","0","0","0","0",0,"0","0","0","0",0,"0","0","0","1","0","1","0","1","0","0",0,"0","0","0","1",0,"0","0","0","0",0,"0","0","0",0,"4","0",2021-11-11 10:51:48
"fr",9349659,"1","Eloise",,"Unknown",,,,"0","0","0",,,"9","0","0","0","0","1","0","0","0",0,0,"0","1","0","0","0","0","0","0","0","0","0","0","0",0,"0","0","0",0,"0",0,"1","0","0","0","0",0,"0",0,"0","0","0","0",0,"1","0","0","0","0","0","0",0,"0","0","1",0,"0","0","0","0","0","0","0","0","0","0","0","0","0","0","0","0","0","0","0","0","0","0",0,"0","0","0","0",0,"0","0","0","1","0","1","0","0","0","0",0,"0","0","0","0",0,"0","0","0","0",0,"0","0","0",0,"3","0",2021-11-11 10:51:51
"fr",9349672,"0",,,,,,,,,,,,,,,,,,,,,,,,,,,,,,,,,,,,,,,,,,,,,,,,,,,,,,,,,,,,,,,,,,,,,,,,,,,,,,,,,,,,,,,,,,,,,,,,,,,,,,,,,,,,,,,,,,,,,,,,,,,2021-11-11 10:51:54
"fr",9349882,"1","tom8-74",,"Unknown",,,,"0","0","0",,,"6","0","0","0","0","1","0","0","0",0,0,"0","1","0","0","0","0","0","0","0","0","0","0","0",0,"0","0","0",0,"0",0,"1","1","0","0","0",0,"0",0,"0","0","0","0",0,"1","0","0","0","0","0","0",0,"0","0","1",0,"0","0","0","0","0","0","0","0","0","0","18","0","0","0","0","0","0","0","0","0","0","0",0,"0","0","0","0",0,"0","0","0","1","0","1","0","0","0","0",0,"0","0","0","1",0,"0","0","0","0",0,"0","0","0",0,"3","0",2021-11-11 10:51:57
"fr",9349908,"1","Ryan",,"Male",,,,"0","0","0",,,"71","0","0","0","0","0","0","0","0",0,0,"0","18","0","1","0","0","0","0","0","0","2","2","0",0,"4","0","0",0,"0",0,"8","9","0","0","0",0,"0",0,"0","3","1","0",0,"0","1","0","0","0","4","2",0,"4","0","4",0,"0","0","4","0","0","55","0","69","0","0","0","0","0","0","26","0","0","41","0","0","0","0",0,"0","0","0","2",0,"0","0","14","3","0","0","14","5","0","0",0,"0","0","1","7",0,"0","0","0","0",0,"0","0","0",0,"10","0",2021-11-11 10:52:01
"fr",9349926,"0",,,,,,,,,,,,,,,,,,,,,,,,,,,,,,,,,,,,,,,,,,,,,,,,,,,,,,,,,,,,,,,,,,,,,,,,,,,,,,,,,,,,,,,,,,,,,,,,,,,,,,,,,,,,,,,,,,,,,,,,,,,2021-11-11 10:52:04
"fr",9349931,"0",,,,,,,,,,,,,,,,,,,,,,,,,,,,,,,,,,,,,,,,,,,,,,,,,,,,,,,,,,,,,,,,,,,,,,,,,,,,,,,,,,,,,,,,,,,,,,,,,,,,,,,,,,,,,,,,,,,,,,,,,,,2021-11-11 10:52:07
"fr",9349956,"1","SkN-Toxi",,"Unknown",,,,"0","0","0",,,"7","0","0","0","0","1","0","0","0",0,0,"0","4","0","0","0","0","0","0","0","0","0","0","0",0,"1","0","0",0,"0",0,"5","9","0","0","0",0,"0",0,"0","0","0","0",0,"1","0","0","0","0","1","0",0,"1","0","0",0,"0","0","1","0","0","0","0","0","0","0","0","0","0","40","0","0","0","0","0","0","0","0",0,"0","0","0","0",0,"0","0","1","1","0","1","0","4","0","0",0,"0","0","0","2",0,"0","0","0","0",0,"0","0","0",0,"6","1",2021-11-11 10:52:11
"fr",9349981,"0",,,,,,,,,,,,,,,,,,,,,,,,,,,,,,,,,,,,,,,,,,,,,,,,,,,,,,,,,,,,,,,,,,,,,,,,,,,,,,,,,,,,,,,,,,,,,,,,,,,,,,,,,,,,,,,,,,,,,,,,,,,2021-11-11 10:52:14
"fr",9349982,"0",,,,,,,,,,,,,,,,,,,,,,,,,,,,,,,,,,,,,,,,,,,,,,,,,,,,,,,,,,,,,,,,,,,,,,,,,,,,,,,,,,,,,,,,,,,,,,,,,,,,,,,,,,,,,,,,,,,,,,,,,,,2021-11-11 10:52:19
"fr",9349983,"0",,,,,,,,,,,,,,,,,,,,,,,,,,,,,,,,,,,,,,,,,,,,,,,,,,,,,,,,,,,,,,,,,,,,,,,,,,,,,,,,,,,,,,,,,,,,,,,,,,,,,,,,,,,,,,,,,,,,,,,,,,,2021-11-11 10:52:22
"fr",9349986,"0",,,,,,,,,,,,,,,,,,,,,,,,,,,,,,,,,,,,,,,,,,,,,,,,,,,,,,,,,,,,,,,,,,,,,,,,,,,,,,,,,,,,,,,,,,,,,,,,,,,,,,,,,,,,,,,,,,,,,,,,,,,2021-11-11 10:52:25
"fr",9349996,"1","Romain",,"Male",,,,"0","0","1",,,"4","0","0","0","0","0","0","0","0",0,0,"0","0","0","0","0","0","0","0","0","0","0","0","0",0,"1","0","0",0,"0",0,"0","2","0","0","0",0,"0",0,"0","0","0","0",0,"0","0","0","0","0","0","0",0,"0","0","2",0,"0","0","0","0","0","0","0","0","14","0","0","0","0","0","0","0","0","0","0","0","0","0",0,"0","0","0","0",0,"0","0","0","0","0","0","0","0","0","0",0,"0","0","0","0",0,"0","0","0","0",0,"0","0","0",0,"3","0",2021-11-11 10:52:29
"fr",9350018,"0",,,,,,,,,,,,,,,,,,,,,,,,,,,,,,,,,,,,,,,,,,,,,,,,,,,,,,,,,,,,,,,,,,,,,,,,,,,,,,,,,,,,,,,,,,,,,,,,,,,,,,,,,,,,,,,,,,,,,,,,,,,2021-11-11 10:52:32
"fr",9350020,"1","Wander",,"Male",,,"France","0","0","1",,,"12","0","0","0","0","0","0","0","0",0,0,"0","2","0","0","0","0","0","0","0","0","0","0","0",0,"1","0","0",0,"0",0,"1","4","0","0","0",0,"0",0,"0","0","0","0",0,"0","0","0","0","0","0","0",0,"0","0","0",0,"0","0","1","0","0","17","0","0","0","0","0","0","0","0","0","0","0","0","0","0","0","0",0,"0","0","0","0",0,"0","0","0","1","0","1","0","0","0","0",0,"0","0","0","0",0,"0","0","0","0",0,"0","0","0",0,"3","0",2021-11-11 10:52:36
"fr",9350089,"1","Doc",,"Unknown",,,,"0","0","0",,,"1","0","0","0","0","0","0","0","0",0,0,"0","0","0","0","0","0","0","0","0","0","0","0","0",0,"1","0","0",0,"0",0,"1","2","0","0","0",0,"0",0,"0","0","0","0",0,"1","0","0","0","0","0","0",0,"0","0","0",0,"0","0","0","25","0","0","0","0","0","0","0","0","0","0","0","0","0","0","0","0","0","0",0,"0","0","0","0",0,"0","0","0","1","0","1","0","0","0","0",0,"0","0","0","0",0,"0","0","0","0",0,"0","0","0",0,"4","0",2021-11-11 10:52:40
"fr",9350092,"1","Dodo777",,"Male","19","paris","france","0","0","0",,,"19","0","0","0","0","1","0","0","0",0,0,"0","1","0","0","0","0","0","0","0","0","0","0","0",0,"0","0","0",0,"0",0,"0","1","0","0","0",0,"0",0,"0","0","0","0",0,"1","0","0","0","0","1","0",0,"1","0","2",0,"0","0","0","0","0","0","0","11","0","0","0","0","0","0","0","12","0","0","0","0","23","0",0,"0","0","0","0",0,"1","0","0","1","0","1","0","0","0","0",0,"0","0","0","4",0,"0","0","0","0",0,"0","0","0",0,"6","0",2021-11-11 10:52:43
"fr",9350116,"1","kevlos",,"Unknown",,,,"0","0","0",,,"0","0","0","0","0","0","0","0","0",0,0,"0","0","0","0","0","0","0","0","0","0","0","0","0",0,"0","0","0",0,"0",0,"0","0","0","0","0",0,"0",0,"0","0","0","0",0,"0","0","0","0","0","0","0",0,"0","0","0",0,"0","0","0","0","0","0","0","0","0","0","0","0","0","0","0","0","0","0","0","0","0","0",0,"0","0","0","0",0,"0","0","0","0","0","0","0","0","0","0",0,"0","0","0","1",0,"0","0","0","0",0,"0","0","0",0,"2","1",2021-11-11 10:52:46
"fr",9350184,"0",,,,,,,,,,,,,,,,,,,,,,,,,,,,,,,,,,,,,,,,,,,,,,,,,,,,,,,,,,,,,,,,,,,,,,,,,,,,,,,,,,,,,,,,,,,,,,,,,,,,,,,,,,,,,,,,,,,,,,,,,,,2021-11-11 10:52:49
"fr",9350193,"0",,,,,,,,,,,,,,,,,,,,,,,,,,,,,,,,,,,,,,,,,,,,,,,,,,,,,,,,,,,,,,,,,,,,,,,,,,,,,,,,,,,,,,,,,,,,,,,,,,,,,,,,,,,,,,,,,,,,,,,,,,,2021-11-11 10:52:52